{"text_format":"1","workbook":"xlsx","n_sheets":4,"sheets":["Instructions","Power for specified means","Power for minimum difference","Power for a performed ANOVA"],"not_rendered":{"charts":3,"images":0,"macros":1,"external_links":1,"defined_names":2,"comments":0,"pivot_tables":0},"unopened":[],"bounds":{"document_bytes":16777216,"sheet_cells":100000,"rows_first":2000,"rows_last":500,"rows_between":2000,"halvings":0,"cell_chars":16384,"cell_head_chars":4096},"cells_cut":0,"cells_raw":0,"read":"whole","date_system":"1900"}

{"sheet":"Instructions","index":0,"n_rows":39,"n_cols":2,"rows_kept":39,"cut":false,"hidden":false,"merged":[]}
["Australian Journal of Experimental Agriculture, 1998, 38 617-22"]
["Mick O'Neill & Peter Thomson"]
["       Biometry Unit, Faculty of Agriculture, University of Sydney, Australia 2006 (MickO@agric.usyd.edu.au)"]
["Updated by Maryann O'Donnell, August 2004"]
[]
["1.   In the worksheet Power for specified means you can determine the power for a given scenario of treatment means"]
["       in a proposed one factor experiment. Change the formula for df in cell E9 for a different design."]
[]
["Choice 1: ","Provide the proposed sample sizes and anticipated set of treatment means;"]
[null,"the power is calculated automatically provided an estimate of variance is available."]
[]
["2.   In the worksheet Power for minimum difference you can determine the power, sample size or minimum detectable difference"]
["       in a proposed one factor experiment. "]
["      An estimate of variance is required in C11. Change the formula for Error df in cell C16 for a different design."]
[]
["Choice 2: ","Provide the proposed sample size and anticipated smallest mean difference;"]
[null,"the power is calculated automatically"]
[]
["Choice 3: ","Provide the desired power and anticipated smallest mean difference of your test;"]
[null,"to obtain the required sample size (per treatment),  run Tools/Solver.  You need to:"]
[null,"• ensure that C18 is entered in the Set Target Cell: box"]
[null,"• enter your desired power in the Value of: box"]
[null,"• ensure that C9 is entered in the By Changing Cells: box"]
[null,"• click on Solve. The solution in C9 will show as an integer but it is probably fractional.  "]
[null,"   Replace it by its solved value and one more than its solved value, and check the power."]
[]
["Choice 4: ","Provide the desired power and sample size of your test;"]
[null,"to obtain the required minimum detectable difference:"]
[null,"• enter your proposed sample size in cell C9. Then run Tools/Solver. You need to:"]
[null,"• ensure that C18 is entered in the Set Target Cell: box"]
[null,"• enter your desired power in the Value of: box"]
[null,"• ensure that C11 is entered in the By Changing Cells: box"]
[null,"• click on Solve. The solution in C12 is the required minimum detectable difference"]
[null,"• select the approprite design number for CRD, RCBD, or Latin Square. "]
[]
["3.   In the worksheet Power for a given ANOVA you can determine the power for the F-test of an experiment already conducted."]
[]
["Choice 5: ","Provide the information from your ANOVA  (d.f., Mean Squares and significance level)"]
[null,"the power of the F-test is calculated automatically. Works for any experimental design."]

{"sheet":"Power for specified means","index":1,"n_rows":600,"n_cols":9,"rows_kept":600,"cut":false,"hidden":false,"merged":[]}
["Choice 1: ","Calculation of the power of a proposed one factor (unblocked) experiment"]
[null,null,null," "]
["treatment","mean","replicate"]
[{"$f":"IF(ROW(A4)<=t+3,ROW(A4)-3,IF(A3=t,\"Enter means and replicates above\",\"\"))","v":1},3,10,"Enter first the number of treatments in your proposed experiment:",4]
[2,6,10,"The Treatment df for your proposed ANOVA are:",{"$f":"t-1","v":3}]
[{"$f":"IF(ROW(A6)<=t+3,ROW(A6)-3,IF(A5=t,\"Enter means and replicates above\",\"\"))","v":3},7,10,"Enter an estimate of the variance of each treatment:",7]
[4,8,10,"Choose the level of significance for your proposed F-test:",0.05]
[{"$f":"IF(ROW(A8)<=t+3,ROW(A8)-3,IF(A7=t,\"Enter means and replicates above\",\"\"))","v":"Enter means and replicates above"},null,null,"Non centrality F-parameter (l)",{"$f":"(SUMPRODUCT(B4:B34^2,C4:C34)-SUMPRODUCT(B4:B34,C4:C34)^2/SUM(C4:C34))/E6","v":20}]
[{"$f":"IF(ROW(A8)<=t+3,ROW(A8)-3,IF(A7=t,\"and delete entries below\",\"\"))","v":"and delete entries below"},null,null,"The Error df for your proposed ANOVA are:",{"$f":"SUM((C4:C33)*(ROW(C4:C33)-3<=t))-$E$4","v":36}]
[{"$f":"IF(ROW(A10)<=t+3,ROW(A10)-3,IF(A9=t,\"Enter means and replicates above\",\"\"))","v":""},null,null,"Your ANOVA Fcrit value is:",{"$f":"FINV($E$7,$E$4-1,$E$9)","v":2.866265557082313}]
["",null,null,"The power of your ANOVA F-test is:",{"$f":"powermd(E8,E5,E9,E10)","v":0.95818554292794766}]
[""]
[""]
[""]
[""]
[""]
[""]
[""]
[""]
["",null,null,null,null,"F-dist (means equal)"]
[{"$f":"IF(ROW(A21)<=t+3,ROW(A21)-3,IF(A20=t,\"Enter means and replicates above\",\"\"))","v":""},null,null,null,null,"F-dist (means different)"]
["",null,null,null,null,"Fcrit"]
[""]
[""]
[""]
[""]
[""]
[""]
[""]
[""]
[""]
["",null,null,"significance level is the area under the blue curve to the right of Fcrit"]
[""]
["",null,null,"power is the area under the brown curve to the right of Fcrit"]
[]
[]
[]
[]
[]
[]
[]
[]
[]
[]
[]
[]
[]
[]
[]
[]
[]
[]
[]
[]
[]
[]
[]
[]
[]
[]
[]
[]
[]
[]
[]
[]
[]
[]
[]
[]
[]
[]
[]
[]
[]
[]
[]
[]
[]
[]
[]
[]
[]
[]
[]
[]
[]
[]
[]
[]
[]
[]
[]
[]
[]
[]
[]
[null,null,null,null,6,12,18]
[null,null,null,null,500,"Central F","Non-central F","Red line"]
[null,null,null,null,0,{"$f":"CentralF($E$5,$E$9,E100)","v":0},{"$f":"NonCentralF($E$5,$E$9,$E$8,E100)","v":0},{"$f":"$E$10","v":2.866265557082313},0]
[null,null,null,null,{"$f":"E100+IF($E$11<1/3,$E$98/$E$99,IF($E$11<2/3,$F$98/$E$99,$G$98/$E$99))","v":3.5999999999999997E-2},{"$f":"CentralF($E$5,$E$9,E101)","v":0.37866806578355972},{"$f":"NonCentralF($E$5,$E$9,$E$8,E101)","v":2.4748017179465032E-5},{"$f":"$E$10","v":2.866265557082313},{"$f":"MAX(I102:I103)","v":5.4983369529116075E-2}]
[null,null,null,null,7.1999999999999995E-2,0.50522083116658345,4.5642731095994638E-5,null,{"$f":"NonCentralF($E$5,$E$9,$E$8,E10)","v":4.7533638907210997E-2}]
[null,null,null,null,0.10799999999999998,0.58386139548053828,7.0785279828897244E-5,null,{"$f":"CentralF($E$5,$E$9,E10)","v":5.4983369529116075E-2}]
[null,null,null,null,0.14399999999999999,0.63626330500817052,1.0118320179859426E-4]
[null,null,null,null,0.18,0.67146604121598297,1.3753418819971406E-4]
[null,null,null,null,0.216,0.69441777570690111,1.8046659503718167E-4]
[null,null,null,null,0.252,0.70822935645713869,2.3059020778371436E-4]
[null,null,null,null,0.28799999999999998,0.71502744914194838,2.8851099520471975E-4]
[null,null,null,null,0.32399999999999995,0.71634870443684895,3.5483567215896972E-4]
[null,null,null,null,0.35999999999999993,0.71334725345745764,4.3017266959230666E-4]
[null,null,null,null,0.39599999999999991,0.70691459488170705,5.1513163705396736E-4]
[null,null,null,null,0.43199999999999988,0.69775389220937167,6.1032228265500298E-4]
[null,null,null,null,0.46799999999999986,0.68642860620414736,7.1635291256022266E-4]
[null,null,null,null,0.50399999999999989,0.67339575334148749,8.3382881508088842E-4]
[null,null,null,null,0.53999999999999992,0.65902947837819692,9.6335057506067169E-4]
[null,null,null,null,0.57599999999999996,0.64363826414679892,1.1055123832028819E-3]
[null,null,null,null,0.61199999999999999,0.6274778117641826,1.2609003442693343E-3]
[null,null,null,null,0.64800000000000002,0.61076088491377911,1.4300908102264579E-3]
[null,null,null,null,0.68400000000000005,0.59366496949891467,1.6136487643673787E-3]
[null,null,null,null,0.72000000000000008,0.57633832550095676,1.8121262442799045E-3]
{"$rows_left_out":481}
{"sheet":"Power for minimum difference","index":2,"n_rows":600,"n_cols":7,"rows_kept":600,"cut":false,"hidden":false,"merged":[]}
[null,"Calculation of the"]
["Choice 2: ","·   power"]
["Choice 3: ","·  sample size per treatment"]
["Choice 4: ","·  minimum detectable difference"]
[null," of a proposed one factor (unblocked) experiment"]
[null,null,null,"Design Number",null,0,"for  CRD"]
[null,"Enter the number of treatments in your proposed experiment:",4,0,"In D7, enter:",1,"for RCBD "]
[null,"The Treatment df for your proposed ANOVA are:",{"$f":"C7-1","v":3},{"$f":"IF(D7>2,\"Invalid design number!\",\"\")","v":""},null,2,"for Latin Square design"]
[null,"Enter the proposed number of replicates (or blocks) per treatment:",8,null,{"$f":"IF(D7=2,\"Type\",\"\")","v":""},{"$f":"IF(D7=2,\"=C9\",\"\")","v":""},{"$f":"IF(D7=2,\"in C7\",\"\")","v":""}]
[]
[null,"Enter an estimate of the variance of each treatment (e.g. from a previous ANOVA):",1]
[null,"Enter the smallest difference to detect between the 2 most different means:",2]
[null,"Choose the level of significance for your proposed F-test:",0.05]
[]
[null,"Non centrality F-parameter (l)",{"$f":"C9*C12^2/2/C11","v":16}]
[null,"The Error df for your proposed ANOVA are:",{"$f":"($C$7-D7)*($C$9-1)","v":28}]
[null,"Your ANOVA Fcrit value is:",{"$f":"FINV($C$13,$C$7-1,$C$7*($C$9-1))","v":2.9466852687816703}]
[null,"The power of your ANOVA F-test is:",{"$f":"powermd(C15,C8,C16,C17)","v":0.89359784283076671}]
[null,null,null,"see graph below"]
[]
[]
[]
[]
[]
[]
[null,null,null,"F-dist (means equal)"]
[null,null,null,"F-dist (means different)"]
[null,null,null,"Fcrit"]
[]
[]
[]
[]
[]
[]
[]
[]
[]
[]
[null,"significance level is the area under the blue curve to the right of Fcrit"]
[]
[null,"power is the area under the brown curve to the right of Fcrit"]
[]
[]
[]
[]
[]
[]
[]
[]
[]
[]
[]
[]
[]
[]
[]
[]
[]
[]
[]
[]
[]
[]
[]
[]
[]
[]
[]
[]
[]
[]
[]
[]
[]
[]
[]
[]
[]
[]
[]
[]
[]
[]
[]
[]
[]
[]
[]
[]
[]
[]
[]
[]
[]
[]
[]
[]
[null,null,6,12,18]
[null,null,500,"Central F","Non-central F","Red line"]
[null,null,0,{"$f":"CentralF($C$8,$C$16,C100)","v":0},{"$f":"NonCentralF($C$8,$C$16,$C$15,C100)","v":0},{"$f":"$C$17","v":2.9466852687816703},0]
[null,null,{"$f":"C100+IF($C$18<1/3,$C$98/$C$99,IF($C$18<2/3,$D$98/$C$99,$E$98/$C$99))","v":3.5999999999999997E-2},{"$f":"CentralF($C$8,$C$16,C101)","v":0.38035725022802724},{"$f":"NonCentralF($C$8,$C$16,$C$15,C101)","v":1.7245261536376425E-4},{"$f":"$C$17","v":2.9466852687816703},{"$f":"MAX(G102:G103)","v":9.4126093459731761E-2}]
[null,null,{"$f":"C101+IF($C$18<1/3,$C$98/$C$99,IF($C$18<2/3,$D$98/$C$99,$E$98/$C$99))","v":7.1999999999999995E-2},0.50686396788601973,3.0174887884145063E-4,null,{"$f":"NonCentralF($C$8,$C$16,$C$15,F101)","v":9.4126093459731761E-2}]
[null,null,0.10799999999999998,0.58508692530747175,4.4733621585141742E-4,null,{"$f":"CentralF($C$8,$C$16,F101)","v":5.1952582326287321E-2}]
[null,null,0.14399999999999999,0.63689960267532353,6.1444875763310488E-4]
[null,null,0.18,0.67143554806809469,8.056326095802794E-4]
[null,null,0.216,0.69369680711363146,1.0226903878754045E-3]
[null,null,0.252,0.70682760571792158,1.2671126959797807E-3]
[null,null,0.28799999999999998,0.71297588685366109,1.5402153793497042E-3]
[null,null,0.32399999999999995,0.71369180990740089,1.8431919549257488E-3]
[null,null,0.35999999999999993,0.71013776757536706,2.1771357438659508E-3]
[null,null,0.39599999999999991,0.70320986483455039,2.5430496185421814E-3]
[null,null,0.43199999999999988,0.69361328003236178,2.9418502372562747E-3]
[null,null,0.46799999999999986,0.68191163783897302,3.3743697329770813E-3]
[null,null,0.50399999999999989,0.66856079854048345,3.8413562102505897E-3]
[null,null,0.53999999999999992,0.65393281930309344,4.3434737360245907E-3]
[null,null,0.57599999999999996,0.63833345286275567,4.8813021949364235E-3]
[null,null,0.61199999999999999,0.62201524460750324,5.4553371758237178E-3]
[null,null,0.64800000000000002,0.60518754061387525,6.0659900006962576E-3]
[null,null,0.68400000000000005,0.58802427119677558,6.713587960607708E-3]
[null,null,0.72000000000000008,0.57067009635135679,7.3983747669728473E-3]
{"$rows_left_out":481}
{"sheet":"Power for a performed ANOVA","index":3,"n_rows":600,"n_cols":7,"rows_kept":600,"cut":false,"hidden":false,"merged":[]}
["Choice 5: ","Calculation of the power of a performed ANOVA F-test:"]
[null,"Enter the Treatment df from your ANOVA:",3]
[null,"Enter the Error df from your ANOVA:",10]
[null,"Enter the Treatment MS from your ANOVA:",5.19,null,{"$f":"IF($C4<$C5,\"Power is inappropriate when TMS < EMS\",\"\")","v":""}]
[null,"Enter the Error MS from your ANOVA:",0.8]
[null,"Choose the level of significance for your F-test:",0.05,{"$f":"IF($C7<$C8,\"Test is not significant at this level\",\"Test is significant at this level\")","v":"Test is significant at this level"}]
[null,"Your Fobs value is:",{"$f":"C4/C5","v":6.4874999999999998}]
[null,"Your Fcrit value is:",{"$f":"FINV($C$6,C2,C3)","v":3.708264819458714}]
[null,"The non-centrality parameter for the ANOVA F-test is:",{"$f":"(C2*(C4-C5)/C5)","v":16.462500000000002}]
[null,"The power of your F-test is:",{"$f":"powermd(C9,C2,C3,C8)","v":0.80622727061174504}]
[]
[]
[]
[]
[]
[]
[]
[]
[]
[]
[]
[]
[null,null,null,null,"F-dist (means equal)"]
[null,null,null,null,"F-dist (means different)"]
[null,null,null,null,"Fcrit"]
[]
[]
[]
[]
[]
[]
[]
[null,"significance level is the area under the blue curve to the right of Fcrit"]
[]
[null,"power is the area under the brown curve to the right of Fcrit"]
[]
[]
[]
[]
[]
[]
[]
[]
[]
[]
[]
[]
[]
[]
[]
[]
[]
[]
[]
[]
[]
[]
[]
[]
[]
[]
[]
[]
[]
[]
[]
[]
[]
[]
[]
[]
[]
[]
[]
[]
[]
[]
[]
[]
[]
[]
[]
[]
[]
[]
[]
[]
[]
[]
[]
[]
[]
[]
[]
[]
[]
[]
[null,null,6,12,18]
[null,null,500,"Central F","Non-central F","Red line"]
[null,null,0,{"$f":"CentralF($C$2,$C$3,C100)","v":0},{"$f":"NonCentralF($C$2,$C$3,$C$9,C100)","v":0},{"$f":"$C$8","v":3.708264819458714},0]
[null,null,{"$f":"C100+IF($C$10<1/3,$C$98/$C$99,IF($C$10<2/3,$D$98/$C$99,$E$98/$C$99))","v":3.5999999999999997E-2},{"$f":"CentralF($C$2,$C$3,C101)","v":0.39352505655786857},{"$f":"NonCentralF($C$2,$C$3,$C$9,C101)","v":1.5034133190067455E-4},{"$f":"$C$8","v":3.708264819458714},{"$f":"MAX(G102:G103)","v":0.10925657269521748}]
[null,null,{"$f":"C101+IF($C$10<1/3,$C$98/$C$99,IF($C$10<2/3,$D$98/$C$99,$E$98/$C$99))","v":7.1999999999999995E-2},{"$f":"CentralF($C$2,$C$3,C102)","v":0.51938051932586382},2.7396293756860206E-4,null,{"$f":"NonCentralF($C$2,$C$3,$C$9,F101)","v":0.10925657269521748}]
[null,null,{"$f":"C102+IF($C$10<1/3,$C$98/$C$99,IF($C$10<2/3,$D$98/$C$99,$E$98/$C$99))","v":0.10799999999999998},0.59408017568111948,4.2027948318582411E-4,null,{"$f":"CentralF($C$2,$C$3,F101)","v":3.3157312937236116E-2}]
[null,null,0.14399999999999999,0.641116777645934,5.9453804718213345E-4]
[null,null,0.18,0.67037442519306678,7.9983631585759806E-4]
[null,null,0.216,0.68727374788464901,1.0386302247098235E-3]
[null,null,0.252,0.69520881158663794,1.3130535407928289E-3]
[null,null,0.28799999999999998,0.69647892506084852,1.6250120186693641E-3]
[null,null,0.32399999999999995,0.69272357473497637,1.9762147501782394E-3]
[null,null,0.35999999999999993,0.68515363090114334,2.3681844117733487E-3]
[null,null,0.39599999999999991,0.67468611679935075,2.8022599151904795E-3]
[null,null,0.43199999999999988,0.66202834609434036,3.2795965040136824E-3]
[null,null,0.46799999999999986,0.64773330208916702,3.8011654109465828E-3]
[null,null,0.50399999999999989,0.6322376401614398,4.3677539615746448E-3]
[null,null,0.53999999999999992,0.6158886536771111,4.9799665331968874E-3]
[null,null,0.57599999999999996,0.59896393736049425,5.6382265012264177E-3]
[null,null,0.61199999999999999,0.58168605128937223,6.3427791972335557E-3]
[null,null,0.64800000000000002,0.56423366271143882,7.0936958509478015E-3]
[null,null,0.68400000000000005,0.54675014525218257,7.8908784284506938E-3]
[null,null,0.72000000000000008,0.52935030404346273,8.7340652810355291E-3]
{"$rows_left_out":480}